KCLUL/GEOG
in scheme: providers
definition: Based in the very heart of London on the College's Strand Campus, ours is one of the most international Geography Departments in the UK. Drawing on the best traditions of Geography as an integrative academic subject, we are committed to research and to teaching that is engaged and interdisciplinary. Summary Provided By: http://www.kcl.ac.uk/schools/sspp/geography
type: Concept

ACADEMIC
type: Concept