CCSP/GCRIO
in scheme: providers
definition: The US Global Change Research Information Office (GCRIO) provides access to data and information on climate change research, adaptation/mitigation strategies and technologies, and global change-related educational resources on behalf of the various US Federal Agencies that are involved in the US Global Change Research Program (USGCRP). GCRIO offers the following products and services to its users. Summary Provided By: http://www.gcrio.org/about/index.htm
type: Concept

CCSP
type: Concept