NOAA
type: Concept

DOC/NOAA/OAR/ARP
in scheme: providers
definition: It is NOAA's Arctic mission to observe and understand Arctic processes and provide information to U.S. policy and decision makers. NOAA's activities in the Arctic are directed toward integration of Arctic observations, advancement of Arctic modeling efforts, improving Arctic satellite observations, providing leadership on Arctic ocean and coastal issues, and providing Arctic air and sea observations that are critical to assessing change in the climate system.
type: Concept