SNOW MEASURING ROD
change note: 2021-08-05 17:10:50.0 [sritz] insert AltLabel (id: null category: primary text: SNOW MEASURING ROD language code: en);
in scheme: instruments
definition: A snow measuring rod is a specially designed rod that is pushed into the snow until the underlying surface is reached to measure snow depth.
type: Concept

Probes
type: Concept