COMMERCIAL
type: Concept

AFI
in scheme: providers
definition: For more than three decades, the principals of Aquarius Flight Inc. have achieved excellence in aerial photography, airborne exploration and remote sensing in support of mapping, land-use capability studies and world resource development. Initially concentrated in the domestic field, Aquarius has steadily expanded its horizons to include projects that encompass the globe. Aquarius personnel provide a special combination of extensive experience and state-of-the-art aircraft, camera and remote sensing equipment for each client's individual and frequently unique requirements. [Summary provided by Aquarius Flight Inc.]
type: Concept