OCEAN WINDS
type: Concept

TURBULENCE
in scheme: sciencekeywords
definition: A state of fluid (wind) flow in which the instantaneous (wind) velocities exhibit irregular and apparently random fluctuations so that in practice only statistical properties can be recognized and subjected to analysis.
type: Concept