TMI
change note: 2020-01-29 17:38:29.0 [sritz] update Definition (The Tropical Rainfall Measuring Mission’s (TRMM) Microwave Imager (TMI) is a passive microwave sensor designed to provide quantitative rainfall information over a wide swath under the TRMM satellite. By carefully measuring the minute amounts of microwave energy emitted by the Earth and its atmosphere, TMI is able to quantify the water vapor, the cloud water, and the rainfall intensity in the atmosphere. It is a relatively small instrument that consumes little power. This, combined with the wide swath and the good, quantitative information regarding rainfall make TMI the "workhorse" of the rain-measuring package on Tropical Rainfall Measuring Mission. NASA Earth Science Reference Handbook [ Mission: TRMM ] More information: https://pmm.nasa.gov/TRMM/TMI Group: Instrument_Details Entry_ID: TMI Group: Instrument_Identification Instrument_Category: Earth Remote Sensing Instruments Instrument_Class: Passive Remote Sensing Instrument_Type: Spectrometers/Radiometers Instrument_Subtype: Imaging Spectrometers/Radiometers Short_Name: TMI Long_Name: TRMM Microwave Imager End_Group Group: Instrument_Associated_Sensors Short_Name: TMI End_Group Group: Associated_Platforms Short_Name: TRMM End_Group Group: Spectral_Frequency_Information Wavelength_Keyword: Microwave Number_Channels: 9 Spectral_Frequency_Coverage_Range: 10.65, 19.35, 37.0, and 85.5 GHz at dual polarization and 22.235 GHz at vertical polarization Spectral_Frequency_Resolution: 37 to 4.6-km resolution respectively, covering 760-km swath End_Group Online_Resource: https://trmm.gsfc.nasa.gov/overview_dir/tmi.html Online_Resource: https://pmm.nasa.gov/TRMM/TMI Creation_Date: 2007-05-08 Group: Instrument_Logistics Data_Rate: 8.5 Kbps Instrument_Start_Date: 1997-12-08 Instrument_Owner: USA/NASA End_Group End_Group); update Definition (https://pmm.nasa.gov/TRMM/TMI);
in scheme: instruments
definition: The Tropical Rainfall Measuring Mission’s (TRMM) Microwave Imager (TMI) is a passive microwave sensor designed to provide quantitative rainfall information over a wide swath under the TRMM satellite. By carefully measuring the minute amounts of microwave energy emitted by the Earth and its atmosphere, TMI is able to quantify the water vapor, the cloud water, and the rainfall intensity in the atmosphere. It is a relatively small instrument that consumes little power. This, combined with the wide swath and the good, quantitative information regarding rainfall make TMI the "workhorse" of the rain-measuring package on Tropical Rainfall Measuring Mission. NASA Earth Science Reference Handbook [ Mission: TRMM ] More information: https://pmm.nasa.gov/TRMM/TMI Group: Instrument_Details Entry_ID: TMI Group: Instrument_Identification Instrument_Category: Earth Remote Sensing Instruments Instrument_Class: Passive Remote Sensing Instrument_Type: Spectrometers/Radiometers Instrument_Subtype: Imaging Spectrometers/Radiometers Short_Name: TMI Long_Name: TRMM Microwave Imager End_Group Group: Instrument_Associated_Sensors Short_Name: TMI End_Group Group: Associated_Platforms Short_Name: TRMM End_Group Group: Spectral_Frequency_Information Wavelength_Keyword: Microwave Number_Channels: 9 Spectral_Frequency_Coverage_Range: 10.65, 19.35, 37.0, and 85.5 GHz at dual polarization and 22.235 GHz at vertical polarization Spectral_Frequency_Resolution: 37 to 4.6-km resolution respectively, covering 760-km swath End_Group Online_Resource: https://trmm.gsfc.nasa.gov/overview_dir/tmi.html Online_Resource: https://pmm.nasa.gov/TRMM/TMI Creation_Date: 2007-05-08 Group: Instrument_Logistics Data_Rate: 8.5 Kbps Instrument_Start_Date: 1997-12-08 Instrument_Owner: USA/NASA End_Group End_Group
type: Concept

Imaging Spectrometers/Radiometers
type: Concept