NON-GOVERNMENT/NON-PROFIT ORGANIZATIONS
type: Concept

AMNH/CBC
in scheme: providers
definition: The Center for Biodiversity and Conservations mission is to mitigate critical threats to global biological and cultural diversity by: * advancing scientific research in diverse ecosystems; * strengthening the application of science to conservation practice and public policy; * developing professional, institutional, and community capacity; and * furthering the Museum's efforts to heighten public understanding and stewardship of biodiversity. Summary Provided By: http://cbc.amnh.org/center/about.html
type: Concept