SOIL CLASSIFICATION
change note: 2017-03-10 09:12:55.0 [tstevens] update Definition (The taxonomy of a soil, the great order, suborder, and great group of the soil based upon the characteristics and properties.); update Definition (Adapted from: Glossary of Soil Science Terms, 1997. Soil Science Society of America, Madison, WI. );
in scheme: sciencekeywords
definition: The taxonomy of a soil, the great order, suborder, and great group of the soil based upon the characteristics and properties.
type: Concept

SOILS
type: Concept