AU/QLD/DPI/ACA
in scheme: providers
definition: The Queensland Node of the Australian Coastal Atlas lets you view layers of information about the Queensland coast, you can even print out your own custom map. The Atlas includes maps and images of the coastal zone showing information about water quality, climate, fisheries and more. Website: "http://acaweb.dpi.qld.gov.au/aca/" [Summary provided by Queensland Government Department of Primary Industries]
type: Concept

AUSTRALIA
type: Concept