UK/ST/CREEM/RUWPA
in scheme: providers
definition: The Centre for Research into Ecological and Environmental Modelling is an inter-disciplinary research centre at the University of St Andrews, linking researchers from the Schools of Mathematics and Statistics, Biology and Geography and Geosciences. Our remit is to develop and apply advanced mathematical and statistical methods to practical problems in biology, ecology and geography. Summary Provided By: http://creem2.st-andrews.ac.uk/
type: Concept

ACADEMIC
type: Concept