SEDIMENT COMPOSITION
in scheme: sciencekeywords
definition: The constituent materials of a sediment sample; including trace metals, organic material or contaminants.
type: Concept

MARINE SEDIMENTS
type: Concept