NSF
type: Concept

UCAR/JOSS
in scheme: providers
definition: The Joint Office for Science Support (JOSS) mission is to provide scientific, technical, and administrative support services to the research community for the purpose of planning, organizing, and implementing research programs and associated field projects worldwide. Website: "http://www.joss.ucar.edu/" [Summary provided by UCAR.]
type: Concept