MULTINATIONAL ORGANIZATIONS
type: Concept

UN/WHO
change note: 2013-04-04 09:07:58.0 [tbs1979] Insert Concept add broader relation (UN/WHO [18c5e622-2039-44f9-94e0-cf7682c08cf6,83249] - MULTINATIONAL ORGANIZATIONS [756a90f8-4203-46f1-87e9-9e0d64bdee50,66455]);
in scheme: providers
definition: The World Health Organization is the directing and coordinating authority for health within the United Nations system. It is responsible for providing leadership on global health matters, shaping the health research agenda, setting norms and standards, articulating evidence-based policy options, providing technical support to countries and monitoring and assessing health trends. In the 21st century, health is a shared responsibility, involving equitable access to essential care and collective defense against transnational threats.
type: Concept