RUTGERS/CC/DES/GSMDB
in scheme: providers
definition: The Valdai water-balance research station in the forest zone of Russia is operated by the State Hydrological Institute in St. Petersburg, Russia. Data were collected from three catchments: Usadievskiy, Tayozhniy, and Sinaya Gnilka. The data set consists of 15 files which include monthly runoff, depth of ground water table, water equivalent snow depth, monthly evaporation for Usadievskiy, monthly precipitation at Valdai, and daily data for Usadievskiy including soil temperature and runoff data. Summary Provided By: http://clic.npolar.no/disc/disc_datasets_metadata.php?s=0&desc=1&table=Datasets&id=DISC_GCMD_GLOBAL_SM_DATABANK_VALDAI&tag=All&Category=&WCRP=&Location=All&stype=phrase&limit=10&q=
type: Concept

ACADEMIC
type: Concept