COLORED DISSOLVED ORGANIC MATTER
change note: 2021-10-19 12:40:45.0 [tstevens] insert Definition (id: null text: Optically measurable component of the dissolved organic matter in the water. language code: en);
change note: 2021-10-19 12:39:32.0 [tstevens] Insert Concept add broader relation (COLORED DISSOLVED ORGANIC MATTER [18e0fad3-b6f4-4120-9221-f82fb2ffd384,778203] - ORGANIC MATTER [b2bdeb71-81b5-43e6-a8b1-b09c215c8d1a,776178]);
in scheme: sciencekeywords
definition: Optically measurable component of the dissolved organic matter in the water.
type: Concept

ORGANIC MATTER
type: Concept