NSF
type: Concept

UCAR/NSDL
in scheme: providers
definition: The National Science Digital Library (NSDL) is an online science library with links to high quality science, technology, engineering, and math resources for K-12 teachers, faculty, librarians, students and informal learners. Funded by the National Science Foundation.
type: Concept