LTP
in scheme: projects
definition: The NASA Learning Technologies Project (LTP) is NASA’s educational technology incubator. LTP funds activities and collaborates with endeavors that incorporate NASA content with revolutionary technologies or innovative use of entrenched technologies to enhance education in the areas of math and science. Summary provided by http://learn.arc.nasa.gov/about/index.html
type: Concept

J - L
type: Concept