STANFORD-U/STAR/VLF
in scheme: providers
definition: The Stanford University Very Low Frequency Group (VLF) investigates the earth's electrical environment, its upper atmosphere, lightning discharges, radiation belts, and the ionized regions of the earth's upper atmosphere known as the ionosphere and magnetosphere. Website: http://vlf.stanford.edu/ [Summary provided by Stanford University.]
type: Concept

ACADEMIC
type: Concept