ATMOSPHERIC CARBON DIOXIDE
type: Concept

CARBON DIOXIDE SURFACE
change note: 2021-03-02 09:33:51.0 [tstevens] update Definition (Measurement of Carbon Dioxide gas at the surface of the earth.);
change note: 2021-03-02 09:26:11.0 [tstevens] insert Definition (id: null text: Measurement of Carbon Dioxide gas at the surface of the earth language code: en);
change note: 2021-02-26 08:41:33.0 [tstevens] Insert Concept add broader relation (CARBON DIOXIDE SURFACE [194d8a3c-9cdd-45f3-8b4c-ce7830d9df46,560866] - ATMOSPHERIC CARBON DIOXIDE [c3b81888-8a39-4b3f-8033-4c077797bcba,83947]);
in scheme: sciencekeywords
definition: Measurement of Carbon Dioxide gas at the surface of the earth.
type: Concept