DOE/LLNL/IPCC
in scheme: providers
definition: Lawrence Livermore National Laboratory (LLNL) is a premier applied science laboratory that is part of the National Nuclear Security Administration (NNSA) within the Department of Energy (DOE). LLNL was managed from its inception in 1952 through September 2007 by the University of California for the U.S. government. LLNL is currently managed by Lawrence Livermore National Security, LLC. As a national security laboratory, LLNL is responsible for ensuring that the nation’s nuclear weapons remain safe, secure, and reliable through application of advances in science and engineering. With its special capabilities, the Laboratory also meets other pressing national security needs, which include countering the proliferation of weapons of mass destruction and strengthening homeland security against the terrorist use of such weapons. Our breakthrough advances are made possible by an extraordinary technical staff and investments in research facilities that provide LLNL wide ranging capabilities. The Laboratory is an international leader in many areas of science and technology central to our national security mission. Summary provided by https://www.llnl.gov/llnl/about/
type: Concept

DOE
type: Concept