USDA
type: Concept

USDA/ARS/JPCSNRCC
in scheme: providers
definition: Mission: The mission of the J. Phil Campbell Sr., Natural Resource Conservation Center is to develop and transfer environmentally sustainable and profitable agricultural systems to land owners and managers in order to protect the natural resource base, build accord with non-agricultural sectors, and support healthy rural economie. Summary provided by: http://www.ars.usda.gov/AboutUs/AboutUs.htm?modecode=66-12-09-00
type: Concept