NEWTEL
in scheme: providers
definition: NewTel is one of the fastest growing phone companies in Ireland. Incorporated in 1999 our main focus is on price, billing and service. NewTel's current product portfolio includes voice, line rental, broadband and dial up internet access. We are also able to provide customers with a single bill for phone calls, line rental and broadband. At NewTel we recognise that the customer comes first - tailoring our products to our customer's requirements and not the other way around. NewTel's current product portfolio includes voice, line rental, broadband / dial up internet access, all on one simple and concise single bill. In August 2007 Pure Telecom acquired NewTel. Pure Telecom is Ireland's fastest growing business telecom's provider. Major customers include multinational companies, government agencies and financial institutions. This new relationship will allow NewTel to stay ahead of the market, to enhance and expand the services currently available to our customers and to develop new and innovative products. Summary Provided By: http://www.newtel.ie/about.php
type: Concept

COMMERCIAL
type: Concept