RIVERS/STREAM
type: Concept

INTERMITTENT STREAM
change note: 2016-06-13 12:41:26.0 [gee-cee] insert Definition (id: null text: Pertaining to channels that experience seasonal water flow and may not have flowing surface water during dry periods. language code: en);
change note: 2016-06-13 12:41:06.0 [gee-cee] Insert Concept add broader relation (INTERMITTENT STREAM [1b5d3b68-4f89-4772-b015-ce6f30cf0496,188201] - RIVERS/STREAM HABITAT [43d51c24-0523-4b65-919f-17618c7d72b4,84269]);
in scheme: sciencekeywords
definition: Pertaining to channels that experience seasonal water flow and may not have flowing surface water during dry periods.
type: Concept