NASA/ARC/LT/WW
in scheme: providers
definition: World Wind lets you zoom from satellite altitude into any place on Earth. Leveraging Landsat satellite imagery and Shuttle Radar Topography Mission data, World Wind lets you experience Earth terrain in visually rich 3D, just as if you were really there. Virtually visit any place in the world. Look across the Andes, into the Grand Canyon, over the Alps, or along the African Sahara. Summary Provided By: http://worldwind.arc.nasa.gov/index.html
type: Concept

NASA
type: Concept