USDA/FS/RD/TS
in scheme: providers
definition: The research and development (R&D) arm of the U.S. Department of Agriculture (USDA) Forest Service works at the forefront of science to improve the health and use of our Nation's forests and grasslands. Research has been part of the Forest Service mission since the agency's inception in 1905. Today, some 500-plus Forest Service researchers work in a range of biological, physical, and social science fields to promote sustainable management of Nation's diverse forests and rangelands. Their research covers a lot of territory, with programs in all 50 states, U.S. territories, and commonwealths. The work has a steady focus on informing policy and land management decisions, whether it addresses invasive insects, degraded river ecosystems, or sustainable ways to harvest forest products. The researchers work independently and with a range of partners, including other agencies, academia, nonprofit groups, and industry. The information and technology produced through basic and applied science programs is available to the public for its benefit and use. Summary provided by: http://www.fs.fed.us/research/
type: Concept

USDA
type: Concept