A - C
type: Concept

ACE (Antarctic)
change note: 2018-12-04 15:10:36.0 [sritz] insert AltLabel (id: null category: primary text: Antarctic Cirumnavigation Expedition language code: en); insert Definition (id: null text: The Antarctic Circumnavigation Expedition (ACE), organised by the Swiss Polar Institute (SPI), took place in the austral summer of 2016 / 17. Scientists from all over the world studied a wide range of disciplines, collecting data and samples from the Southern Ocean and a number of terrestrial sites on islands around Antarctica, as well as the continent itself. language code: en);
change note: 2018-12-04 15:09:45.0 [sritz] Insert Concept add broader relation (ACE (Antarctic) [1ceedc1e-8285-471a-813f-fd302a653993,368291] - A - C [0c89f3f4-7ab1-43ce-89ee-795d35f0e30a,349499]);
in scheme: projects
definition: The Antarctic Circumnavigation Expedition (ACE), organised by the Swiss Polar Institute (SPI), took place in the austral summer of 2016 / 17. Scientists from all over the world studied a wide range of disciplines, collecting data and samples from the Southern Ocean and a number of terrestrial sites on islands around Antarctica, as well as the continent itself.
type: Concept