COMMON SENSE CLIMATE INDEX
change note: 2013-10-11 17:29:03.0 [saritz] Added new definition. insert Definition (id: null text: Our climate index is a simple measure of the degree, if any, to which practical climate change is occurring. It also illustrates natural climate variability, thus revealing how difficult it is to reliably perceive a change of quantities that are naturally ‘‘noisy’’ or chaotic. Our aim is to help people judge whether or not climate fluctuations are a significant indication of change and to provide improved understanding of climate variability. More Information: http://data.giss.nasa.gov/csci/ language code: en);
change note: 2013-09-04 15:50:00.0 [epneff] Insert Concept add broader relation (COMMON SENSE CLIMATE INDEX [1d527151-57b2-49ed-9937-c1756a704ce9,105817] - ATMOSPHERIC TEMPERATURE INDICES [25d73bcf-c8d4-4c0e-ac98-8f3e98677e73,105815]);
in scheme: sciencekeywords
definition: Our climate index is a simple measure of the degree, if any, to which practical climate change is occurring. It also illustrates natural climate variability, thus revealing how difficult it is to reliably perceive a change of quantities that are naturally ‘‘noisy’’ or chaotic. Our aim is to help people judge whether or not climate fluctuations are a significant indication of change and to provide improved understanding of climate variability. More Information: http://data.giss.nasa.gov/csci/
type: Concept

ATMOSPHERIC TEMPERATURE INDICES
type: Concept