ACADEMIC
type: Concept

UNIV-PARIS/LODYC
in scheme: providers
definition: Data Center Research Themes: Variability in the subpolar North Atlantic and Arctic (JC Gascard) - thermohaline circulation and its processes in the Atlantic - Interactions t-sea level climate (C. Frankignoul) - Large-scale circulation and climate variability of the Southern Ocean (YH Park) - Climate Survey by the use of modeling and experimentation (P. Delecluse) - Regional seas and coastal (M. Crépon) - paleoceanography (C. Pierre) - biogeochemical cycles: space observations and in situ (L. Merlivat) - Studies of biogeochemical cycles and marine ecosystems using the numerical modeling (L. MEMERY) _ modeling and advanced statistical methods.
type: Concept