Beidou
type: Concept

GNSS RECEIVER
change note: 2017-08-15 10:28:02.0 [tstevens] insert Definition (id: null text: GNSS receivers detect, decode, and process signals from the GNSS satellites. The satellites transmit the ranging codes on two radio-frequency carriers, allowing the locations of GNSS receivers to be determined with varying degrees of accuracy, depending on the receiver and post-processing of the data. language code: en);
change note: 2017-08-14 15:41:38.0 [tstevens] Insert Concept add broader relation (GNSS RECEIVER [1e11acdb-0f09-4562-9558-db3a80f9bbb0,309979] - Beidou [43d17037-c574-4abc-9831-d9c5064e00f7,309975]);
in scheme: instruments
definition: GNSS receivers detect, decode, and process signals from the GNSS satellites. The satellites transmit the ranging codes on two radio-frequency carriers, allowing the locations of GNSS receivers to be determined with varying degrees of accuracy, depending on the receiver and post-processing of the data.
type: Concept