ENERGY PRODUCTION/USE
type: Concept

TIDAL ENERGY PRODUCTION/USE
change note: 2012-06-29 13:55:45.0 [tbs1979] insert Definition (id: null text: Refers to the production and use of tidal energy for human consumption. Tidal energy is the energy involved in tidal movements of water which is available to be harnessed if those movements can be used to turn turbines. language code: en);
change note: 2012-06-26 15:47:23.0 [tbs1979] Insert Concept add broader relation (TIDAL ENERGY PRODUCTION/USE [1eb6eeff-77f8-40b6-8e4a-2e4438f00b10,40121] - ENERGY PRODUCTION/USE [b73cee46-8e2c-4df9-b1ed-7f0aa98a04ac,40101]);
in scheme: sciencekeywords
definition: Refers to the production and use of tidal energy for human consumption. Tidal energy is the energy involved in tidal movements of water which is available to be harnessed if those movements can be used to turn turbines.
type: Concept