Radar Sounders
type: Concept

HiCARS2
definition: HiCARS is a VHF ice-penetrating radar which operates in frequency-chirped mode from 52.5 to 67.5 MHz.
change note: 2013-11-19 16:07:41.0 [aaleman] added new keyword insert AltLabel (id: null text: High Capability Radar Sounder language code: en);
change note: 2013-11-19 16:07:13.0 [aaleman] Insert Concept add broader relation (HiCARS [1fda092b-8f01-4810-a8e5-284efa1210c8,105941] - Radar Sounders [6c5ca722-0bc7-4ccd-ad24-39b9d8710140,74849]);
change note: 2017-07-28 09:59:32.0 [aaleman] modified keyword at request of NSIDC update AltLabel (Hi-Capability Radar Sounder Version2); update PrefLabel (HiCARS2);
change note: 2013-11-19 16:08:24.0 [aaleman] added definition insert Definition (id: null text: HiCARS is a VHF ice-penetrating radar which operates in frequency-chirped mode from 52.5 to 67.5 MHz. language code: en);
type: Concept
in scheme: instruments