CLIMATE ADAPTATION
change note: 2019-09-11 08:27:37.0 [tstevens] Insert Concept add broader relation (CLIMATE ADAPTATION [223e1204-e305-43d2-80d0-8baed8c828c0,369143] - GLOBAL CHANGE RESPONSES [f69374fe-eda2-4223-b130-096220251235,369139]);
alternative label: Climate Change Adaptation
in scheme: sciencekeywords
definition: Adjustment in natural or human systems to a new or changing environment that exploits beneficial opportunities or moderates negative effects of a changing climate.
type: Concept

GLOBAL CHANGE RESPONSES
type: Concept