COASTAL PROCESSES
type: Concept

BOTTOM COVER TYPE
change note: 2021-10-19 08:46:55.0 [tstevens] insert Definition (id: null text: The general three-dimensional features of the bottom and whether it is covered in sand, coral, sediment, rock, man made objects, etc., to determine benthic zone type. language code: en);
change note: 2021-10-19 08:45:27.0 [tstevens] Insert Concept add broader relation (BOTTOM COVER TYPE [22450240-b06c-4954-a8d6-c6b756dab92d,778192] - COASTAL PROCESSES [b6fd22ab-dca7-4dfa-8812-913453b5695b,774885]);
in scheme: sciencekeywords
definition: The general three-dimensional features of the bottom and whether it is covered in sand, coral, sediment, rock, man made objects, etc., to determine benthic zone type.
type: Concept