CITIPIX
in scheme: projects
definition: CITIPIX is a project developed by Kodak's Earth imaging department. Data is provided by ALTAPHOTO, in which aerial photography is acquired from the top 95 most populated American Metropolitan Statistical Areas (MSA). It also includes outlyig counties of each MSA and hte 10 most populated Canadian cities with thier outlying areas as well. For more information and sample CITIPIX Imagery, link to "http://kei.kodak.com/specification.asp#"
type: Concept

A - C
type: Concept