MARTEC
in scheme: providers
definition: Martec Limited is a leading engineering firm specializing in the development and application of mathematical modelling and engineering analysis software. Martec provides consulting services, engineering software and contract research for a wide variety of industries including Marine, Offshore, Aerospace and Defence. For over twenty-five years, Martec has worked with private and public sector clients to find analytical solutions to complex engineering problems. Website: "http://www.martec.com/" [Summary provided by Martec]
type: Concept

COMMERCIAL
type: Concept