ALTITUDE
type: Concept

STATION HEIGHT
change note: 2012-06-28 15:13:29.0 [saritz] undo move add broader relation (STATION HEIGHT [2343baae-1c4a-4096-8cac-fea8ed7a984f,23009] - ALTITUDE [16bfcf54-f8e1-4c8e-9bd4-a1ac06ea95a0,20169]); delete broader relation (null);
change note: 2012-06-28 15:13:01.0 [saritz] Move Concepts delete broader relation (null); add broader relation (STATION HEIGHT [2343baae-1c4a-4096-8cac-fea8ed7a984f,23009] - ATMOSPHERE [c47f6052-634e-40ef-a5ac-13f69f6f4c2a,19875]);
in scheme: sciencekeywords
definition: Also called Station Elevation. Station Height is the vertical distance above mean sea level that is adopted as the reference datum level for all current measurements of atmospheric pressure at the station.
type: Concept