TEFLUN-B
in scheme: projects
definition: Texas Florida Underflights Field Experiment(TEFLUN-B) was conducted between August 1 and September 30, 1998 in close coordination with the 3rd Convection And Moisture Experiment (CAMEX-3), and focused principally on east Florida to utilize the existing dense network of ground-based facilities. TEFLUN B page: "http://daac.gsfc.nasa.gov/CAMPAIGN_DOCS/TEFLUN/teflunb.shtml" Additional info on TEFLUN project: "http://www.met.tamu.edu/research/teflun/info.html"
type: Concept

S - U
type: Concept