NON-GOVERNMENT/NON-PROFIT ORGANIZATIONS
type: Concept

OPENDAP
in scheme: providers
definition: OPeNDAP is a software framework that simplifies all aspects of scientific data networking, allowing simple access to remote data. Local data can be made accessible to remote locations regardless of local storage format by using OPeNDAP servers. Existing, familiar data analysis and visualization applications can be transformed into OPeNDAP clients (i.e., applications able to access remote OPeNDAP served data). Summary Provided By: http://opendap.org/faq/whatIsDods.html
type: Concept