TROPICAL CYCLONES
type: Concept

TROPICAL STORM FORCE WIND EXTENT
change note: 2016-07-31 21:48:09.0 [saritz] insert Definition (id: null text: The extent of a tropical storm's wind field. language code: en);
change note: 2016-07-31 17:44:56.0 [saritz] Insert Concept add broader relation (TROPICAL STORM FORCE WIND EXTENT [23c94a4c-db57-4d57-b24f-4dba24aa3cc6,247487] - TROPICAL CYCLONES [06180441-d4bb-4fed-b36a-9b3cb2cac0fe,217775]);
in scheme: sciencekeywords
definition: The extent of a tropical storm's wind field.
type: Concept