POLAND
type: Concept

PL/PAS/IGF
in scheme: providers
definition: The Institute of Geophysics, Polish Academy of Sciences (Instytut Geofizyki Polskiej Akademii Nauk, IGF PAN) is a scientific institution representing the main stream of Polish basic research in Earth sciences. It is the only institution in Poland that performs monitoring of geophysical fields in seismology, geomagnetism, and selected areas of atmospheric physics.
type: Concept