GPS
type: Concept

GPS Vector V103
change note: 2023-07-19 11:42:48.0 [sritz] insert AltLabel (id: null category: primary text: Hemisphere Vector V103/113 GPS Compass language code: en);
change note: 2023-07-19 11:46:02.0 [sritz] insert Definition (id: null text: Now with GLONASS, the IMO Wheelmarked Vector™ V103™ and V113™ GNSS compass series are known for their superb heading and positioning performance. With the addition of GLONASS, the V103 and V113 now provide a more robust solution in critical areas where sky blockage occurs. The rugged IP69K design housing is sealed for the harshest environments. It incorporates fixed and pole mounting capabilities for both marine and land applications. The Vector V103 and V113 series of GPS Compasses are suitable for both dynamic positioning and professional marine surveys, as well as for machine control applications in agriculture, mining, construction, and other challenging applications. language code: en);
change note: 2023-07-19 11:41:32.0 [sritz] Insert Concept add broader relation (GPS Vector V103 [24c0bf95-99f3-4fca-88d0-8ffc879ba475,1380224] - GPS [47d0c7c0-683c-42a9-b53b-53b684972b52,1371433]);
type: Concept
in scheme: instruments
definition: Now with GLONASS, the IMO Wheelmarked Vector™ V103™ and V113™ GNSS compass series are known for their superb heading and positioning performance. With the addition of GLONASS, the V103 and V113 now provide a more robust solution in critical areas where sky blockage occurs. The rugged IP69K design housing is sealed for the harshest environments. It incorporates fixed and pole mounting capabilities for both marine and land applications. The Vector V103 and V113 series of GPS Compasses are suitable for both dynamic positioning and professional marine surveys, as well as for machine control applications in agriculture, mining, construction, and other challenging applications.