ACADEMIC
type: Concept

UC-IRVINE/CS
in scheme: providers
change note: 2021-04-08 16:16:12.0 [sritz] Insert Concept add broader relation (UC-IRVINE/ICS [25ad4a6a-ff65-4a58-85da-897423ec87db,578384] - ACADEMIC [7700280b-68ee-4644-bf5e-84e7a6adf897,561669]);
change note: 2021-04-08 16:18:34.0 [sritz] insert AltLabel (id: null category: primary text: Department of Computer Science, University of California, Irvine language code: en); update PrefLabel (UC-IRVINE/CS); insert Definition (id: null text: The Department of Computer Science is internationally recognized as a unique group of faculty, visiting researchers, students and educational programs, which provide a world-class research environment that goes well beyond the core areas of computer science. Our curricula, faculty and research areas focus on an array of topics, including algorithms and complexity; artificial intelligence and machine learning; biomedical informatics and computational biology; computer architecture and design; computer graphics and visualization; computer vision; databases and data mining; embedded systems; medical informatics; multimedia computing; networks and distributed systems; operating systems; programming languages and systems; scientific and numerical computing; security, privacy and cryptography; and software engineering. language code: en); insert Resource (id: null type: provider url: https://www.cs.uci.edu/);
definition: The Department of Computer Science is internationally recognized as a unique group of faculty, visiting researchers, students and educational programs, which provide a world-class research environment that goes well beyond the core areas of computer science. Our curricula, faculty and research areas focus on an array of topics, including algorithms and complexity; artificial intelligence and machine learning; biomedical informatics and computational biology; computer architecture and design; computer graphics and visualization; computer vision; databases and data mining; embedded systems; medical informatics; multimedia computing; networks and distributed systems; operating systems; programming languages and systems; scientific and numerical computing; security, privacy and cryptography; and software engineering.
type: Concept