MAGNETOMETERS
type: Concept

Zhangheng SCM
change note: 2021-08-06 07:29:38.0 [mmorahan] insert AltLabel (id: null category: primary text: Search-Coil Magnetometer language code: en); insert Definition (id: null text: The Search-Coil Magnetometer (SCM) measures the magnetic field fluctuations in ionosphere. Main parameters: - Band: 10 Hz - 20 kHz - Magnitude: 5×10-4- 50 nT - Sensitivity: 1 nT·Hz- 1/2 @ 2 kHz language code: en);
change note: 2021-08-06 07:32:32.0 [mmorahan] insert WeightedRelation (id: null related concept uuid: 52ae802c-b2fd-4548-aefd-ec4e4325b803 relationship type: null relationship value: null generated by: null);
change note: 2021-08-06 07:21:26.0 [mmorahan] Insert Concept add broader relation (Zhangheng SCM [264a8a52-d929-4b07-a0df-0af8a99b1b61,692294] - MAGNETOMETERS [deac2632-5c17-4d15-ae92-c61ebc5a405a,685002]);
change note: 2021-08-06 08:54:16.0 [mmorahan] update Definition (https://directory.eoportal.org/web/eoportal/satellite-missions/content/-/article/cses-zhangheng-1);
type: Concept
in scheme: instruments
definition: The Search-Coil Magnetometer (SCM) measures the magnetic field fluctuations in ionosphere. Main parameters: - Band: 10 Hz - 20 kHz - Magnitude: 5×10-4- 50 nT - Sensitivity: 1 nT·Hz- 1/2 @ 2 kHz