Models
type: Concept

MODELS
alternative label: MODEL
alternative label: COMPUTER MODELS
alternative label: Models/Analyses
change note: 2021-11-30 13:32:04.0 [tstevens] Move Concepts delete broader relation (null); add broader relation (MODELS [26d3953e-be79-46e4-b746-efb1983c3f5c,826076] - Models [0a184cdc-c074-4946-90a6-02f03c686341,835911]);
change note: 2016-06-09 13:28:38.0 [epneff] added altLabel insert AltLabel (id: null text: MODEL language code: en); insert AltLabel (id: null text: Models/Analyses language code: en); insert AltLabel (id: null text: COMPUTER MODELS language code: en);
change note: 2015-08-10 10:40:28.0 [gee-cee] Insert Concept add broader relation (MODELS [26d3953e-be79-46e4-b746-efb1983c3f5c,158193] - Models/Analyses [113ecbc2-ab36-4d58-a96c-a6ce0106e749,143215]);
change note: 2021-07-23 17:08:45.0 [sritz] insert AltLabel (id: null category: primary text: MODELS language code: en);
change note: 2022-03-11 13:11:42.0 [tstevens] insert Definition (id: null text: Graphical, mathematical (symbolic), physical, or verbal representation or simplified version of a concept, phenomenon, relationship, structure, system, or an aspect of the real world. language code: en);
definition: Graphical, mathematical (symbolic), physical, or verbal representation or simplified version of a concept, phenomenon, relationship, structure, system, or an aspect of the real world.
in scheme: platforms
type: Concept