UPPER LEVEL WINDS
type: Concept

WIND DIRECTION
change note: 2017-04-21 11:31:32.0 [tstevens] insert Definition (id: null text: The direction from which the wind is blowing. language code: en);
change note: 2017-04-20 14:50:49.0 [sritz] Insert Concept add broader relation (WIND DIRECTION [272ffe8a-2949-4b58-bb81-52cb1c879f4a,278879] - UPPER LEVEL WINDS [592d49c4-e8ae-4ab4-bf24-ae4a896d0637,83357]);
in scheme: sciencekeywords
definition: The direction from which the wind is blowing.
type: Concept