CLOUD CONDENSATION NUCLEI
in scheme: sciencekeywords
definition: Known as CCN: particles that will take up water to form cloud droplets at or above a specified supersaturation of water.
type: Concept

AEROSOLS
type: Concept