HyspIRI Airborne
change note: 2022-02-07 09:03:41.0 [tstevens] Insert Concept add broader relation (HyspIRI Airborne [2763c022-cc0c-44fc-9708-06b019aa548e,836031] - G - I [af0968ce-ffe3-44a0-86de-2ec9b9a8fa5d,830071]);
in scheme: projects
definition: The Hyperspectral Infrared Imager (HyspIRI) Airborne mission is a multi-year effort to collect seasonal visible to short wave infrared (VSWIR) spectrometer and thermal infrared (TIR) Radiometer data on the world’s ecosystems to provide information on natural disasters such as volcanoes, wildfires, and drought in advance of the HyspIRI satellite mission. HyspIRI campaigns make use of the Airborne Visible/Infrared Imaging Spectrometer (AVIRIS) and the MODIS/ASTER Airborne Simulator (MASTER) facility instruments flown on a NASA ER-2 aircraft. The term HyspIRI-Prep is synonymous to HyspIRI Airborne.
type: Concept

G - I
type: Concept