PURDUE/AG/ABE
in scheme: providers
definition: The Department of Agricultural & Biological Engineering at Purdue University. Helps prepare students, citizens, and industry for the 21st Century through our educational, discovery and engagement efforts. Their cross-disciplinary strengths include academic and research programs in agriculture, biology, and engineering. Our engineering degrees are granted by the College of Engineering and our agricultural systems management degrees are granted by the College of Agriculture. The demand for graduates of our program is excellent with students receiving multiple offers and very competitive salaries. They have several recent additions to our faculty in core as well as strategic areas. Take a few minutes to learn more about our faculty. The Agricultural and Biological Engineering Department has several graduate and post-doctorate opportunities listed on this web-site. Areas of potential research assistantships and fellowships available are listed as well. Website: https://engineering.purdue.edu/ABE/Welcome/ Information provided by: Agricultural & Biological Engineering
type: Concept

ACADEMIC
type: Concept