UCONN/ENGR
in scheme: providers
definition: The School of Engineering at the University of Connecticut consists of 1,500 undergraduate students and 500 graduate students enrolled in the engineering departments. The School offers 12 baccalaureate and 10 graduate (Ph.D.) degree programs and maintains more than 110 faculty, of whom 38 are Fellows of leading professional societies and 35 hold prestigious editorial positions with top professional and academic journals, as well a, three members of the National Academy of Engineering and one member of the National Academy of Science. Website: http://www.engr.uconn.edu/soe.php?pId=missionstmt Info: School of Engineering
type: Concept

ACADEMIC
type: Concept